[sword-devel] cvs build failure

Daniel Glassey sword-devel@crosswire.org
Mon, 5 Nov 2001 11:00:39 -0000

make.exe[3]: Entering directory `C:/cygwin/usr/local/src/sword/src/modules/filters'
gcc -I../../../include/ -D_GNU_SOURCE -DNDEBUG -D_GNU_SOURCE -DNDEBUG -pipe -
Wall -Wno-format -pedantic -pedantic  -fomit-frame-pointer -s -O3 -DUSBINARY -m486 -c 
-o swbasicfilter.o swbasicfilter.cpp
swbasicfilter.cpp: In method `void SWBasicFilter::pushString(char **, const char *, ...)':
swbasicfilter.cpp:112: `va_start' undeclared (first use this function)
swbasicfilter.cpp:112: (Each undeclared identifier is reported only once
swbasicfilter.cpp:112: for each function it appears in.)
swbasicfilter.cpp:114: `va_end' undeclared (first use this function)
swbasicfilter.cpp:110: warning: `char * argptr' might be used uninitialized in this function
make.exe[3]: *** [swbasicfilter.o] Error 1
make.exe[3]: Leaving directory `C:/cygwin/usr/local/src/sword/src/modules/filters'
make.exe[2]: *** [filters/targets] Error 2
make.exe[2]: Leaving directory `C:/cygwin/usr/local/src/sword/src/modules'
make.exe[1]: *** [modules/targets] Error 2
make.exe[1]: Leaving directory `C:/cygwin/usr/local/src/sword/src'
d:\Toys\mingw\bin\make.exe: *** [src/targets] Error 2

You need to
#include <stdarg.h>


P.S. The problem in include/utilstr.h is fixed though

Do You Yahoo!?
Get your free @yahoo.com address at http://mail.yahoo.com