mvnForum Homepage

Print at Nov 1, 2014 1:30:51 AM View all posts in this thread on one page
Posted by wa7qzr at Feb 19, 2005 12:08:56 AM
Comilation problem w/RedHat-7.3
This error is gen'ed on RedHat-7.3, gcc-2.96-113 and appariently all preqsites listed on Bibletime website met. Anyone have a fix for this thingy?

In file included from /usr/include/g++-3/stl_multimap.h:151,
from btinstallmgr.cpp:179:
/usr/include/g++-3/stl_pair.h: In method `pair<const char[10],
sword::SWBuf>::pair (const pair<const char[10], sword::SWBuf> &)':
/usr/include/g++-3/stl_pair.h:68: instantiated from `make_pair (const _T1 &, const _T2 &) [with _T1 = const char[10], _T2 = sword::SWBuf]'
/usr/include/g++-3/stl_pair.h:48: instantiated from here
/usr/include/g++-3/stl_pair.h:68: assignment of read-only location
In file included from /usr/include/g++-3/stl_multimap.h:151,
from btinstallmgr.cpp:179:
/usr/include/g++-3/stl_pair.h: In method `pair<_T1, _T2>::pair (const
_T1 &, const _T2 &) [with _T1 = const char[10], _T2 = sword::SWBuf]':
/usr/include/g++-3/stl_pair.h:67: instantiated from here
/usr/include/g++-3/stl_pair.h:44: assignment of read-only location
make[4]: *** [btinstallmgr.o] Error 1
make[4]: Leaving directory `/usr1/mikem/Software/BibleSoftware/BibleTime/bibletime-1.4.1/bibletime/frontend'
make[3]: *** [all-recursive] Error 1
make[3]: Leaving directory `/usr1/mikem/Software/BibleSoftware/BibleTime/bibletime-1.4.1/bibletime/frontend'
make[2]: *** [all-recursive] Error 1
make[2]: Leaving directory `/usr1/mikem/Software/BibleSoftware/BibleTime/bibletime-1.4.1/bibletime'
make[1]: *** [all-recursive] Error 1
make[1]: Leaving directory `/usr1/mikem/Software/BibleSoftware/BibleTime/bibletime-1.4.1'
make: *** [all] Error 2

I'm not sure where the fatal error begins in the above snip. I'm an assembly-language programmer and this stuff doesn't make a lot of sense to me <g>

Maranatha,

Mike

Posted by wa7qzr at Feb 26, 2005 9:09:57 PM
Re: Comilation problem w/RedHat-7.3
Well, I guess that BibleTime isn't compatible with RedHat-7.3 (and this is something new). So, after an experimental upgrade to RedHat-9, BibleTime compiles and runs okay.

Maranatha,

Mike