mvnForum Homepage

Print at Oct 31, 2014 4:53:05 PM View all posts in this thread on one page
Posted by mezzenger at May 16, 2004 5:55:42 AM
Compile Error
Well, my system crashed and I had to re-install everything. I can't seem to get BT compiled this time! Can anyone help me figure out what I am missing? Here is the error:

libtool: link: warning: library `/usr/local/lib/libsword.la' was moved.
libtool: link: warning: library `/usr/local/lib/libsword.la' was moved.
g++: /usr/lib/libjpeg.so: No such file or directory
make[2]: *** [bibletime] Error 1
make[2]: Leaving directory `/home/alvin/DOWNLOAD/bibletime/bibletime-1.4.1/bibletime'
make[1]: *** [install-recursive] Error 1
make[1]: Leaving directory `/home/alvin/DOWNLOAD/bibletime/bibletime-1.4.1/bibletime'
make: *** [install-recursive] Error 1

Posted by jansorg at May 18, 2004 1:56:28 AM
Re: Compile Error
Have you installed the libjpeg-devel package?

What Linux do you use?

Joachim