mvnForum Homepage

Posted by puddleDuck at Jun 21, 2004 6:38:45 PM
Re: Installation problem on SuSE 8.0
Thanks Joachim. The original problem seems to have been resolved, which now leaves:

/usr/include/g++/stl_pair.h:44: incompatible types in assignment of `const char[10]' to `char[10]'
make[4]: *** [btinstallmgr.o] Error 1
make[4]: Leaving directory `/usr/local/bibletime-1.4.1/bibletime/frontend'
make[3]: *** [all-recursive] Error 1
make[3]: Leaving directory `/usr/local/bibletime-1.4.1/bibletime/frontend'
make[2]: *** [all-recursive] Error 1
make[2]: Leaving directory `/usr/local/bibletime-1.4.1/bibletime'
make[1]: *** [all-recursive] Error 1
make[1]: Leaving directory `/usr/local/bibletime-1.4.1'
make: *** [all] Error 2 the latest difficulty. I also read the follow-on to the thread you suggested at This looks very similar to the error I have above, but I found no response to the query posed in the link. Might you have a solution for this also?

Thanks Again & Best Regards,