mvnForum Homepage


Posted by mezzenger at Jun 16, 2004 5:23:10 AM
make errors
With Fedora Core 2, sword 1.5.7.

./autogen.sh
./usrinst.sh
make

What have I missed?
Thank you.

Tpo -c ../src/mgr/installmgr.cpp -o installmgr.o
../src/mgr/installmgr.cpp: In member function `char
sword::InstallMgr::FTPURLGetFile(void*, const char*, const char*)':
../src/mgr/installmgr.cpp:153: error: `TRUE' undeclared (first use this
function)
../src/mgr/installmgr.cpp:153: error: (Each undeclared identifier is reported
only once for each function it appears in.)
make[2]: *** [installmgr.lo] Error 1
make[2]: Leaving directory `/home/alvin/DOWNLOAD/sword/sword-1.5.7/lib'
make[1]: *** [all-recursive] Error 1
make[1]: Leaving directory `/home/alvin/DOWNLOAD/sword/sword-1.5.7'
make: *** [all] Error 2