mvnForum Homepage


Posted by puddleDuck at Jun 15, 2004 4:44:24 AM
Installation problem on SuSE 8.0
Greetings,

I'm trying to install from source and get the following:

cswordbackend.cpp: In method `CSwordBackend::CSwordBackend(const QString &)':
cswordbackend.cpp:69: ambiguous overload for `bool ? QCString : int'
cswordbackend.cpp:69: candidates are: operator ?:(bool, QCString, QCString) <bui
ltin>
cswordbackend.cpp:69: operator ?:(bool, const char *, const char
*) <builtin>
make[3]: *** [cswordbackend.o] Error 1
make[3]: Leaving directory `/usr/local/bibletime-1.4.1/bibletime/backend'
make[2]: *** [all-recursive] Error 1
make[2]: Leaving directory `/usr/local/bibletime-1.4.1/bibletime'
make[1]: *** [all-recursive] Error 1
make[1]: Leaving directory `/usr/local/bibletime-1.4.1'
make: *** [all] Error 2

I think I've installed all the dependencies properly. I can send more detailed logs to anyone willing to assist.

Thanks & Best Regards,
Steve